Target
Acetylcholinesterase
Ligand
BDBM50008536
Substrate
Meas. Tech.
ChEMBL_29377 (CHEMBL648291)
IC50
3981±n/a nM
Citation
 Cardozo, MGIimura, YSugimoto, HYamanishi, YHopfinger, AJ QSAR analyses of the substituted indanone and benzylpiperidine rings of a series of indanone-benzylpiperidine inhibitors of acetylcholinesterase. J Med Chem 35:584-9 (1992)  
Target
Name:
Acetylcholinesterase
Synonyms:
ACES_HUMAN Acetylcholinesterase (AChE) | Acetylcholinesterase (human AChE)
Type:
Enzyme
Mol. Mass.:
67792.70
Organism:
Homo sapiens (Human)
Description:
P22303
Residue:
614
  
Inhibitor
Name:
BDBM50008536
Synonyms:
1,2-Dimethoxy-4-methyl-benzene | CHEMBL273904
Type:
Small organic molecule
Emp. Form.:
C9H12O2
Mol. Mass.:
152.1904
SMILES:
COc1ccc(C)cc1OC
: