Target
Acetylcholinesterase
Ligand
BDBM50008578
Substrate
Meas. Tech.
ChEBML_29413
IC50
0.900000±n/a nM
Citation
 Cardozo, MGKawai, TIimura, YSugimoto, HYamanishi, YHopfinger, AJ Conformational analyses and molecular-shape comparisons of a series of indanone-benzylpiperidine inhibitors of acetylcholinesterase. J Med Chem 35:590-601 (1992)  
Target
Name:
Acetylcholinesterase
Synonyms:
ACES_HUMAN Acetylcholinesterase (AChE) | Acetylcholinesterase (human AChE)
Type:
Enzyme
Mol. Mass.:
67792.70
Organism:
Homo sapiens (Human)
Description:
P22303
Residue:
614
  
Inhibitor
Name:
BDBM50008578
Synonyms:
2-[2-(1-Methyl-piperidin-4-yl)-ethyl]-isoindole-1,3-dione | CHEMBL345847
Type:
Small organic molecule
Emp. Form.:
C16H20N2O2
Mol. Mass.:
272.3422
SMILES:
CN1CCC(CCN2C(=O)c3ccccc3C2=O)CC1
: