Target
Acetylcholinesterase
Ligand
BDBM50008583
Substrate
Meas. Tech.
ChEBML_29413
IC50
480±n/a nM
Citation
 Cardozo, MGKawai, TIimura, YSugimoto, HYamanishi, YHopfinger, AJ Conformational analyses and molecular-shape comparisons of a series of indanone-benzylpiperidine inhibitors of acetylcholinesterase. J Med Chem 35:590-601 (1992)  
Target
Name:
Acetylcholinesterase
Synonyms:
ACES_HUMAN Acetylcholinesterase (AChE) | Acetylcholinesterase (human AChE)
Type:
Enzyme
Mol. Mass.:
67792.70
Organism:
Homo sapiens (Human)
Description:
P22303
Residue:
614
  
Inhibitor
Name:
BDBM50008583
Synonyms:
2-(4-Methyl-piperidin-1-ylmethyl)-indan-1-one | CHEMBL156763
Type:
Small organic molecule
Emp. Form.:
C16H21NO
Mol. Mass.:
243.344
SMILES:
CC1CCN(CC2Cc3ccccc3C2=O)CC1
: