Target
Neprilysin
Ligand
BDBM50008613
Substrate
Meas. Tech.
ChEBML_64516
IC50
11±n/a nM
Citation
 Mimura, TNakamura, YNishino, JSawayama, TKomiya, TDeguchi, TKita, ANakamura, HMatsumoto, J A novel class of enkephalinase inhibitors containing a C-terminal sulfo group. J Med Chem 35:602-8 (1992)  
Target
Name:
Neprilysin
Synonyms:
Mme Neprilysin Neutral endopeptidase 24.11
Type:
Protein
Mol. Mass.:
85789.59
Organism:
Rattus norvegicus (Rat)
Description:
P07861
Residue:
750
  
Inhibitor
Name:
BDBM50008613
Synonyms:
CHEMBL157079 | Sodium; 4-[(2-mercaptomethyl-3-phenyl-propionylamino)-methyl]-benzenesulfonate (0.5H2O)
Type:
Small organic molecule
Emp. Form.:
C17H18NO4S2
Mol. Mass.:
364.46
SMILES:
[O-]S(=O)(=O)c1ccc(CNC(=O)C(CS)Cc2ccccc2)cc1
: