Target
Neprilysin
Ligand
BDBM50008623
Substrate
Meas. Tech.
ChEBML_64516
IC50
3.5±n/a nM
Citation
 Mimura, TNakamura, YNishino, JSawayama, TKomiya, TDeguchi, TKita, ANakamura, HMatsumoto, J A novel class of enkephalinase inhibitors containing a C-terminal sulfo group. J Med Chem 35:602-8 (1992)  
Target
Name:
Neprilysin
Synonyms:
Mme Neprilysin Neutral endopeptidase 24.11
Type:
Protein
Mol. Mass.:
85789.59
Organism:
Rattus norvegicus (Rat)
Description:
P07861
Residue:
750
  
Inhibitor
Name:
BDBM50008623
Synonyms:
CHEMBL440183 | Sodium; 2-[3-(4-fluoro-phenyl)-2-mercaptomethyl-propionylamino]-ethanesulfonate (H2O)
Type:
Small organic molecule
Emp. Form.:
C12H15FNO4S2
Mol. Mass.:
320.381
SMILES:
[O-]S(=O)(=O)CCNC(=O)C(CS)Cc1ccc(F)cc1
: