Target
Prothrombin
Ligand
BDBM50249298
Substrate
Meas. Tech.
ChEBML_1691139
IC50
18000±n/a nM
Citation
 Xing, JYang, LYang, YZhao, LWei, QZhang, JZhou, JZhang, H Design, synthesis and biological evaluation of novel 2,3-dihydroquinazolin- 4(1H)-one derivatives as potential fXa inhibitors. Eur J Med Chem 125:411-422 (2017)  
Target
Name:
Prothrombin
Synonyms:
Activation peptide fragment 1 Coagulation factor II Prothrombin precursor Thrombin heavy chain | Thrombin light chain
Type:
Protein
Mol. Mass.:
70029.57
Organism:
Homo sapiens (Human)
Description:
P00734
Residue:
622
  
Inhibitor
Name:
BDBM50249298
Synonyms:
BEVYXXA N-(5-chloropyridin-2-yl)-2-(4-(N,N-dimethylcarbamimidoyl)benzamido)-5-methoxybenzamide | betrixaban
Type:
Small organic molecule
Emp. Form.:
C23H22ClN5O3
Mol. Mass.:
451.905
SMILES:
COc1ccc(NC(=O)c2ccc(cc2)C(=N)N(C)C)c(c1)C(=O)Nc1ccc(Cl)cn1
: