Target
Kappa-type opioid receptor
Ligand
BDBM50008849
Substrate
Meas. Tech.
ChEMBL_145205 (CHEMBL753522)
IC50
10000±n/a nM
Citation
 Costello, GFJames, RShaw, JSSlater, AMStutchbury, NC 2-(3,4-Dichlorophenyl)-N-methyl-N-[2-(1-pyrrolidinyl)-1-substituted- ethyl]-acetamides: the use of conformational analysis in the development of a novel series of potent opioid kappa agonists. J Med Chem 34:181-9 (1991)  
Target
Name:
Kappa-type opioid receptor
Synonyms:
Kappa Opioid Receptor OPRK1 Opiate Kappa 1 | mu/kappa opioid receptor
Type:
G Protein-Coupled Receptor (GPCR)
Mol. Mass.:
42744.99
Organism:
Cavia porcellus (domestic guinea pig)
Description:
P41144
Residue:
380
  
Inhibitor
Name:
BDBM50008849
Synonyms:
2-(3,4-Dichloro-phenyl)-N-methyl-N-(1-methyl-2-pyrrolidin-1-yl-ethyl)-acetamide | CHEMBL54451
Type:
Small organic molecule
Emp. Form.:
C16H22Cl2N2O
Mol. Mass.:
329.265
SMILES:
C[C@H](CN1CCCC1)N(C)C(=O)Cc1ccc(Cl)c(Cl)c1
: