Target
Mu-type opioid receptor
Ligand
BDBM50008981
Substrate
Meas. Tech.
ChEBML_146241
IC50
1600±n/a nM
Citation
 Bagley, JRThomas, SARudo, FGSpencer, HKDoorley, BMOssipov, MHJerussi, TPBenvenga, MJSpaulding, T New 1-(heterocyclylalkyl)-4-(propionanilido)-4-piperidinyl methyl ester and methylene methyl ether analgesics. J Med Chem 34:827-41 (1991)  
Target
Name:
Mu-type opioid receptor
Synonyms:
M-OR-1 Mu opioid receptor OPIATE Mu OPRM_CAVPO
Type:
Enzyme Catalytic Domain
Mol. Mass.:
11165.58
Organism:
GUINEA PIG
Description:
P97266
Residue:
98
  
Inhibitor
Name:
BDBM50008981
Synonyms:
CHEMBL169587 | N-{1-[2-(1,3-Dioxo-1,3-dihydro-isoindol-2-yl)-ethyl]-4-methoxymethyl-piperidin-4-yl}-N-phenyl-propionamide
Type:
Small organic molecule
Emp. Form.:
C26H31N3O4
Mol. Mass.:
449.542
SMILES:
CCC(=O)N(c1ccccc1)C1(COC)CCN(CCN2C(=O)c3ccccc3C2=O)CC1
: