Target
Cysteinyl leukotriene receptor 1
Ligand
BDBM50006799
Substrate
Meas. Tech.
ChEMBL_52217 (CHEMBL666686)
Ki
3±n/a nM
Citation
 Shaw, AKrell, RD Peptide leukotrienes: current status of research. J Med Chem 34:1235-42 (1991)  
Target
Name:
Cysteinyl leukotriene receptor 1
Synonyms:
CLTR1_CAVPO | CYSLTR1
Type:
Enzyme Catalytic Domain
Mol. Mass.:
39007.58
Organism:
GUINEA PIG
Description:
Leukotriene D4 0 GUINEA PIG::Q2NNR5
Residue:
340
  
Inhibitor
Name:
BDBM50006799
Synonyms:
2-{4-[2-(1H-Tetrazol-5-ylmethyl)-benzyloxy]-phenoxymethyl}-quinoline 2-{4-[2-(1H-Tetrazol-5-ylmethyl)-benzyloxy]-phenoxymethyl}-quinoline(RG 12525) RG-12525
Type:
Small organic molecule
Emp. Form.:
C25H21N5O2
Mol. Mass.:
423.4665
SMILES:
C(Oc1ccc(OCc2ccccc2Cc2nnn[nH]2)cc1)c1ccc2ccccc2n1
: