Target
Vesicular acetylcholine transporter
Ligand
BDBM50009596
Substrate
Meas. Tech.
ChEBML_213552
IC50
1400±n/a nM
Citation
 Efange, SMMichelson, RHDutta, AKParsons, SM Acyclic analogues of 2-(4-phenylpiperidino)cyclohexanol (vesamicol): conformationally mobile inhibitors of vesicular acetylcholine transport. J Med Chem 34:2638-43 (1991)  
Target
Name:
Vesicular acetylcholine transporter
Synonyms:
TorVAChT VAChT
Type:
PROTEIN
Mol. Mass.:
56111.93
Organism:
Torpedo californica
Description:
ChEMBL_1503355
Residue:
515
  
Inhibitor
Name:
BDBM50009596
Synonyms:
1-Naphthalen-1-yl-3-(4-phenyl-piperidin-1-yl)-propan-2-ol | CHEMBL314881
Type:
Small organic molecule
Emp. Form.:
C24H27NO
Mol. Mass.:
345.4773
SMILES:
OC(CN1CCC(CC1)c1ccccc1)Cc1cccc2ccccc12
: