Target
Mu-type opioid receptor
Ligand
BDBM50009677
Substrate
Meas. Tech.
ChEBML_146268
Ki
7300±n/a nM
Citation
 Jacobson, ARTam, SWSayre, LM Modification of the enkephalin"message" with an artificial polycationic C-terminus. J Med Chem 34:2816-21 (1991)  
Target
Name:
Mu-type opioid receptor
Synonyms:
M-OR-1 Mu opioid receptor OPIATE Mu OPRM_CAVPO
Type:
Enzyme Catalytic Domain
Mol. Mass.:
11165.58
Organism:
GUINEA PIG
Description:
P97266
Residue:
98
  
Inhibitor
Name:
BDBM50009677
Synonyms:
4-Amino-N-[3-(4-amino-butyrylamino)-propyl]-N-{3-[2-(2-{2-[2-amino-3-(4-hydroxy-phenyl)-propionylamino]-acetylamino}-acetylamino)-3-phenyl-propionylamino]-propyl}-butyramide | CHEMBL94792
Type:
Small organic molecule
Emp. Form.:
C36H55N9O7
Mol. Mass.:
725.878
SMILES:
NCCCC(=O)NCCCN(CCCNC(=O)[C@H](Cc1ccccc1)NC(=O)CNC(=O)CNC(=O)[C@@H](N)Cc1ccc(O)cc1)C(=O)CCCN
: