Target
Integrin alpha-IIb/beta-3
Ligand
BDBM50010166
Substrate
Meas. Tech.
ChEMBL_158828 (CHEMBL884929)
IC50
55300±n/a nM
Citation
 Samanen, JAli, FRomoff, TCalvo, RSorenson, EVasko, JStorer, BBerry, DBennett, DStrohsacker, M Development of a small RGD peptide fibrinogen receptor antagonist with potent antiaggregatory activity in vitro. J Med Chem 34:3114-25 (1991)  
Target
Name:
Integrin alpha-IIb/beta-3
Synonyms:
Glycoprotein IIb/IIIa
Type:
Mol. Mass.:
Description:
ASSAY_ID of EBI is 30109
Components:
This complex has 2 components.
Component 1
Name:
Integrin beta-3
Synonyms:
CD_antigen=CD61 GPIIIa ITGB3 Platelet membrane glycoprotein IIIa
Type:
Protein
Mol. Mass.:
87038.91
Organism:
Homo sapiens (Human)
Description:
P05106
Residue:
788
  
Component 2
Name:
Integrin alpha-IIb
Synonyms:
CD_antigen=CD41 GPIIb Glycoprotein IIb ITGA2B Integrin alpha-IIb heavy chain Integrin alpha-IIb light chain, form 2 Integrin alpha-V/beta-3 and alpha-IIb/beta 3 | Platelet membrane glycoprotein IIb
Type:
Protein
Mol. Mass.:
113354.85
Organism:
Homo sapiens (Human)
Description:
P08514
Residue:
1039
  
Inhibitor
Name:
BDBM50010166
Synonyms:
CHEMBL2370399 | [16-Acetylamino-13-(4-amino-butyl)-4-carbamoyl-3,3-dimethyl-6,9,12,15-tetraoxo-1,2-dithia-5,8,11,14-tetraaza-cycloheptadec-7-yl]-acetic acid
Type:
Small organic molecule
Emp. Form.:
C22H37N7O8S2
Mol. Mass.:
591.701
SMILES:
CC(=O)N[C@@H]1CSSC(C)(C)[C@@H](NC(=O)[C@@H](CC(O)=O)NC(=O)CNC(=O)[C@@H](CCCCN)NC1=O)C(N)=O
: