Target
Integrin alpha-IIb/beta-3
Ligand
BDBM50010174
Substrate
Meas. Tech.
ChEMBL_158828 (CHEMBL884929)
IC50
138000±n/a nM
Citation
 Samanen, JAli, FRomoff, TCalvo, RSorenson, EVasko, JStorer, BBerry, DBennett, DStrohsacker, M Development of a small RGD peptide fibrinogen receptor antagonist with potent antiaggregatory activity in vitro. J Med Chem 34:3114-25 (1991)  
Target
Name:
Integrin alpha-IIb/beta-3
Synonyms:
Glycoprotein IIb/IIIa
Type:
Mol. Mass.:
Description:
ASSAY_ID of EBI is 30109
Components:
This complex has 2 components.
Component 1
Name:
Integrin beta-3
Synonyms:
CD_antigen=CD61 GPIIIa ITGB3 Platelet membrane glycoprotein IIIa
Type:
Protein
Mol. Mass.:
87038.91
Organism:
Homo sapiens (Human)
Description:
P05106
Residue:
788
  
Component 2
Name:
Integrin alpha-IIb
Synonyms:
CD_antigen=CD41 GPIIb Glycoprotein IIb ITGA2B Integrin alpha-IIb heavy chain Integrin alpha-IIb light chain, form 2 Integrin alpha-V/beta-3 and alpha-IIb/beta 3 | Platelet membrane glycoprotein IIb
Type:
Protein
Mol. Mass.:
113354.85
Organism:
Homo sapiens (Human)
Description:
P08514
Residue:
1039
  
Inhibitor
Name:
BDBM50010174
Synonyms:
3-[4-amino(imino)methylamino-1-methylcarboxamido-(1S)-butylcarboxamidomethylcarboxamido]-3-carbamoylpropanoic acid CHEMBL104534
Type:
Small organic molecule
Emp. Form.:
C14H25N7O6
Mol. Mass.:
387.3916
SMILES:
CC(=O)N[C@@H](CCCNC(N)=N)C(=O)NCC(=O)N[C@@H](CC(O)=O)C(N)=O
: