Target
D(1A) dopamine receptor
Ligand
BDBM50010693
Substrate
Meas. Tech.
ChEBML_58644
Ki
75±n/a nM
Citation
 Gao, YGBaldessarini, RJKula, NSNeumeyer, JL Synthesis and dopamine receptor affinities of enantiomers of 2-substituted apomorphines and their N-n-propyl analogues. J Med Chem 33:1800-5 (1990)  
Target
Name:
D(1A) dopamine receptor
Synonyms:
DOPAMINE D1 Dopamine D1 high Dopamine receptor Dopamine1-like Drd1a
Type:
Enzyme Catalytic Domain
Mol. Mass.:
49429.75
Organism:
RAT
Description:
P18901
Residue:
446
  
Inhibitor
Name:
BDBM50010693
Synonyms:
2-Chloro-6-methyl-5,6,6a,7-tetrahydro-4H-dibenzo[de,g]quinoline-10,11-diol | CHEMBL431946
Type:
Small organic molecule
Emp. Form.:
C17H16ClNO2
Mol. Mass.:
301.767
SMILES:
CN1CCc2cc(Cl)cc-3c2[C@H]1Cc1ccc(O)c(O)c-31
: