Target
Folylpolyglutamate synthase, mitochondrial
Ligand
BDBM50010924
Substrate
Meas. Tech.
ChEBML_68517
IC50
>200000±n/a nM
Citation
 Abraham, AMcGuire, JJGalivan, JNimec, ZKisliuk, RLGaumont, YNair, MG Folate analogues. 34. Synthesis and antitumor activity of non-polyglutamylatable inhibitors of dihydrofolate reductase. J Med Chem 34:222-7 (1991)  
Target
Name:
Folylpolyglutamate synthase, mitochondrial
Synonyms:
FOLC_HUMAN Folylpoly-gamma-glutamate synthetase Tetrahydrofolate synthase | Tetrahydrofolylpolyglutamate synthase
Type:
PROTEIN
Mol. Mass.:
64621.95
Organism:
Homo sapiens (Human)
Description:
ChEMBL_68676
Residue:
587
  
Inhibitor
Name:
BDBM50010924
Synonyms:
2-{4-[(2,4-Diamino-pteridin-6-ylmethyl)-methyl-amino]-benzoylamino}-4-methylene-pentanedioic acid | CHEMBL65616
Type:
Small organic molecule
Emp. Form.:
C21H22N8O5
Mol. Mass.:
466.45
SMILES:
CN(Cc1cnc2nc(N)nc(N)c2n1)c1ccc(cc1)C(=O)NC(CC(=C)C(O)=O)C(O)=O
: