Target
Dihydrofolate reductase
Ligand
BDBM50010924
Substrate
Meas. Tech.
ChEBML_54215
IC50
6.4±n/a nM
Citation
 Abraham, AMcGuire, JJGalivan, JNimec, ZKisliuk, RLGaumont, YNair, MG Folate analogues. 34. Synthesis and antitumor activity of non-polyglutamylatable inhibitors of dihydrofolate reductase. J Med Chem 34:222-7 (1991)  
Target
Name:
Dihydrofolate reductase
Synonyms:
DHFR Dihydrofolate reductase (DHFR) | Tetrahydrofolate dehydrogenase
Type:
Enzyme
Mol. Mass.:
21453.99
Organism:
Homo sapiens (Human)
Description:
Recombinant human DHFR.
Residue:
187
  
Inhibitor
Name:
BDBM50010924
Synonyms:
2-{4-[(2,4-Diamino-pteridin-6-ylmethyl)-methyl-amino]-benzoylamino}-4-methylene-pentanedioic acid | CHEMBL65616
Type:
Small organic molecule
Emp. Form.:
C21H22N8O5
Mol. Mass.:
466.45
SMILES:
CN(Cc1cnc2nc(N)nc(N)c2n1)c1ccc(cc1)C(=O)NC(CC(=C)C(O)=O)C(O)=O
: