Target
Cyclin-dependent kinase 5
Ligand
BDBM50139171
Substrate
Meas. Tech.
ChEMBL_1714352 (CHEMBL4124401)
IC50
1.000000±n/a nM
Citation
 Wang, YChen, YCheng, XZhang, KWang, HLiu, BWang, J Design, synthesis and biological evaluation of pyrimidine derivatives as novel CDK2 inhibitors that induce apoptosis and cell cycle arrest in breast cancer cells. Bioorg Med Chem 26:3491-3501 (2018)  
Target
Name:
Cyclin-dependent kinase 5
Synonyms:
CDK5 CDKN5 Cyclin-dependent kinase 5 (CDK5/ p25) Cyclin-dependent-like kinase 5 PSSALRE Tau protein kinase II catalytic subunit
Type:
Enzyme Subunit
Mol. Mass.:
33308.61
Organism:
Homo sapiens (Human)
Description:
Residue:
292
  
Inhibitor
Name:
BDBM50139171
Synonyms:
Dinaciclib SCH-727965 US20230416221, Compound Dinaciclib
Type:
Small organic molecule
Emp. Form.:
C21H28N6O2
Mol. Mass.:
396.486
SMILES:
CCc1cnn2c(NCc3ccc[n+]([O-])c3)cc(nc12)N1CCCC[C@H]1CCO
: