Target
Dihydrofolate reductase
Ligand
BDBM50014706
Substrate
Meas. Tech.
ChEMBL_54606 (CHEMBL667328)
Ki
8200±n/a nM
Citation
 DeGraw, JIChristie, PHKisliuk, RLGaumont, YSirotnak, FM Synthesis and antifolate properties of 9-alkyl-10-deazaminopterins. J Med Chem 33:212-5 (1990)  
Target
Name:
Dihydrofolate reductase
Synonyms:
DYR_MOUSE | Dhfr
Type:
Enzyme
Mol. Mass.:
21608.82
Organism:
Mus musculus (Mouse)
Description:
Residue:
187
  
Inhibitor
Name:
BDBM50014706
Synonyms:
2-{4-[2-(2,4-Diamino-pteridin-6-yl)-butyl]-benzoylamino}-pentanedioic acid | CHEMBL302068
Type:
Small organic molecule
Emp. Form.:
C22H25N7O5
Mol. Mass.:
467.4778
SMILES:
CCC(Cc1ccc(cc1)C(=O)NC(CCC(O)=O)C(O)=O)c1cnc2nc(N)nc(N)c2n1
: