Target
3-hydroxy-3-methylglutaryl-coenzyme A reductase
Ligand
BDBM50014956
Substrate
Meas. Tech.
ChEBML_78180
IC50
60±n/a nM
Citation
 Prugh, JDAlberts, AWDeana, AAGilfillian, JLHuff, JWSmith, RLWiggins, JM 3-Hydroxy-3-methylglutaryl-coenzyme A reductase inhibitors. 6. Trans-6-[2-(substituted-1-naphthyl)ethyl(or ethenyl)]-3,4,5,6-tetrahydro-4-hydroxy-2H-pyran-2-ones. J Med Chem 33:758-65 (1990)  
Target
Name:
3-hydroxy-3-methylglutaryl-coenzyme A reductase
Synonyms:
HMDH_RAT Hmgcr
Type:
Enzyme
Mol. Mass.:
96689.85
Organism:
Rattus norvegicus (rat)
Description:
Isolated rat liver microsomes were used as enzyme source.
Residue:
887
  
Inhibitor
Name:
BDBM50014956
Synonyms:
6-[2-(4,7-Dichloro-2-methyl-naphthalen-1-yl)-ethyl]-4-hydroxy-tetrahydro-pyran-2-one | CHEMBL444604
Type:
Small organic molecule
Emp. Form.:
C18H18Cl2O3
Mol. Mass.:
353.24
SMILES:
Cc1cc(Cl)c2ccc(Cl)cc2c1CCC1C[C@@H](O)CC(=O)O1
: