Target
Toll-like receptor 7
Ligand
BDBM50279604
Substrate
Meas. Tech.
ChEMBL_1721300 (CHEMBL4136300)
EC50
4530±n/a nM
Citation
 Larson, PKucaba, TAXiong, ZOlin, MGriffith, TSFerguson, DM Design and Synthesis of N1-Modified Imidazoquinoline Agonists for Selective Activation of Toll-like Receptors 7 and 8. ACS Med Chem Lett 8:1148-1152 (2017)  
Target
Name:
Toll-like receptor 7
Synonyms:
ORF Names:UNQ248/PRO285 TLR7_HUMAN | Toll-like receptor 7 (TLR7)
Type:
Enzyme
Mol. Mass.:
120945.35
Organism:
Homo sapiens (Human)
Description:
Q9NYK1
Residue:
1049
  
Inhibitor
Name:
BDBM50279604
Synonyms:
CHEMBL4163927
Type:
Small organic molecule
Emp. Form.:
C21H26N4O4
Mol. Mass.:
398.4555
SMILES:
CCCCc1nc2c(N)nc3cc(ccc3c2n1CCCC(=O)OC)C(=O)OC
: