Target
Dihydrofolate reductase
Ligand
BDBM50016460
Substrate
Meas. Tech.
ChEMBL_55079 (CHEMBL663892)
IC50
21.0±n/a nM
Citation
 Nair, MGNanavati, NTKumar, PGaumont, YKisliuk, RL Synthesis and biological evaluation of poly-gamma-glutamyl metabolites of 10-deazaaminopterin and 10-ethyl-10-deazaaminopterin. J Med Chem 31:181-5 (1988)  
Target
Name:
Dihydrofolate reductase
Synonyms:
DYR_LACCA folA
Type:
PROTEIN
Mol. Mass.:
18437.08
Organism:
Lactobacillus casei
Description:
ChEMBL_1357878
Residue:
163
  
Inhibitor
Name:
BDBM50016460
Synonyms:
(S)-2-{4-[1-(2,4-Diamino-pteridin-6-ylmethyl)-propyl]-benzoylamino}-pentanedioic acid Edatrexate TCMDC-137768
Type:
Small organic molecule
Emp. Form.:
C22H25N7O5
Mol. Mass.:
467.4778
SMILES:
CCC(Cc1cnc2nc(N)nc(N)c2n1)c1ccc(cc1)C(=O)N[C@@H](CCC(O)=O)C(O)=O
: