Target
Serine/threonine-protein kinase PLK3
Ligand
BDBM50285580
Substrate
Meas. Tech.
ChEBML_1728207
IC50
7146±n/a nM
Citation
 Zhan, MMYang, YLuo, JZhang, XXXiao, XLi, SCheng, KXie, ZTu, ZLiao, C Design, synthesis, and biological evaluation of novel highly selective polo-like kinase 2 inhibitors based on the tetrahydropteridin chemical scaffold. Eur J Med Chem 143:724-731 (2018)  
Target
Name:
Serine/threonine-protein kinase PLK3
Synonyms:
CNK FGF-inducible kinase PLK3 PRK Proliferation-related kinase | Serine/threonine-protein kinase PLK3
Type:
Serine/threonine-protein kinase
Mol. Mass.:
71655.17
Organism:
Homo sapiens (Human)
Description:
Enzyme assays were using PLK3 purified from baculovirus-infected Trichoplusia ni cells expressing full-length PLK3.
Residue:
646
  
Inhibitor
Name:
BDBM50285580
Synonyms:
CHEMBL4163892
Type:
Small organic molecule
Emp. Form.:
C24H28N6O2
Mol. Mass.:
432.5181
SMILES:
CC[C@H]1N(C2CCCC2)c2nc(ncc2N(C)C1=O)-n1ccc2cc(ccc12)C(=O)NC
: