Target
Carbonic anhydrase 2
Ligand
BDBM29278
Substrate
Meas. Tech.
ChEMBL_1735711 (CHEMBL4151247)
Ki
6000±n/a nM
Citation
 Lomelino, CLMurray, ABSupuran, CTMcKenna, R Sweet Binders: Carbonic Anhydrase IX in Complex with Sucralose. ACS Med Chem Lett 9:657-661 (2018)  
Target
Name:
Carbonic anhydrase 2
Synonyms:
CA-II CAC Carbonate dehydratase II Carbonic anhydrase 2 (CA-II) Carbonic anhydrase C Carbonic anhydrase II (CA-II) Carbonic anhydrase II (hCA II) | Carbonic anhydrase isoenzyme II (hCA II)
Type:
Enzyme
Mol. Mass.:
29250.71
Organism:
Homo sapiens (Human)
Description:
P00918
Residue:
260
  
Inhibitor
Name:
BDBM29278
Synonyms:
CHEMBL310671 SAC Saccharin
Type:
Small organic molecule
Emp. Form.:
C7H5NO3S
Mol. Mass.:
183.185
SMILES:
O=C1NS(=O)(=O)c2ccccc12
: