Target
Monoglyceride lipase
Ligand
BDBM50450707
Substrate
Meas. Tech.
ChEMBL_1743307 (CHEMBL4177817)
IC50
3.8±n/a nM
Citation
 Tuo, WLeleu-Chavain, NSpencer, JSansook, SMillet, RChavatte, P Therapeutic Potential of Fatty Acid Amide Hydrolase, Monoacylglycerol Lipase, and N-Acylethanolamine Acid Amidase Inhibitors. J Med Chem 60:4-46 (2017)  
Target
Name:
Monoglyceride lipase
Synonyms:
MAG lipase Mgll Monoglyceride Lipase (MGL)
Type:
Hydrolase
Mol. Mass.:
33391.67
Organism:
Mus musculus (mouse)
Description:
Assays were using membranes of recombinant MAG Lipase transiently transfected in COS-7 cells.
Residue:
303
  
Inhibitor
Name:
BDBM50450707
Synonyms:
CHEMBL4215558
Type:
Small organic molecule
Emp. Form.:
C16H17ClF6N2O4S
Mol. Mass.:
482.826
SMILES:
FC(F)(F)C(OC(=O)N1CCC(CNS(=O)(=O)c2ccc(Cl)cc2)CC1)C(F)(F)F
: