Target
Aldo-keto reductase family 1 member B1
Ligand
BDBM16452
Substrate
Meas. Tech.
ChEMBL_1746137 (CHEMBL4180647)
IC50
25±n/a nM
Citation
 Majekova, MBallekova, JPrnova, MStefek, M Structure optimization of tetrahydropyridoindole-based aldose reductase inhibitors improved their efficacy and selectivity. Bioorg Med Chem 25:6353-6360 (2017)  
Target
Name:
Aldo-keto reductase family 1 member B1
Synonyms:
AKR1B1 ALDR_HUMAN AR Aldose Reductase (ALR2) Aldose reductase (AR)
Type:
Protein
Mol. Mass.:
35855.50
Organism:
Homo sapiens (Human)
Description:
P15121. 4LAU; 2IKI; 4LB4; 2FZD; 2FZ8; 1US0
Residue:
316
  
Inhibitor
Name:
BDBM16452
Synonyms:
(4-oxo-3-{[5-(trifluoromethyl)-1,3-benzothiazol-2-yl]methyl}-3,4-dihydrophthalazin-1-yl)acetic acid Alond Xedia | Zopolrestat
Type:
Small organic molecule
Emp. Form.:
C19H12F3N3O3S
Mol. Mass.:
419.377
SMILES:
OC(=O)Cc1nn(Cc2nc3cc(ccc3s2)C(F)(F)F)c(=O)c2ccccc12
: