Target
Delta-type opioid receptor
Ligand
BDBM50020204
Substrate
Meas. Tech.
ChEMBL_146649 (CHEMBL754933)
IC50
>10000±n/a nM
Citation
 Kazmierski, WWire, WSLui, GKKnapp, RJShook, JEBurks, TFYamamura, HIHruby, VJ Design and synthesis of somatostatin analogues with topographical properties that lead to highly potent and specific mu opioid receptor antagonists with greatly reduced binding at somatostatin receptors. J Med Chem 31:2170-7 (1988)  
Target
Name:
Delta-type opioid receptor
Synonyms:
Cytochrome P450 3A4 Delta opioid receptor Delta-type opioid receptor (DOR) OPRD_RAT Opioid receptor Opioid receptors; mu & delta Ror-a | Voltage-gated potassium channel
Type:
G Protein-Coupled Receptor (GPCR)
Mol. Mass.:
40465.04
Organism:
Rattus norvegicus (rat)
Description:
Competition binding assays were using CHO-K1 cell membranes expressing the opioid receptor.
Residue:
372
  
Inhibitor
Name:
BDBM50020204
Synonyms:
CHEMBL66403 | D-Phec(-Cys-Tyr-Asn-Pen-)Thr-NH2
Type:
Small organic molecule
Emp. Form.:
C34H46N8O9S2
Mol. Mass.:
774.907
SMILES:
C[C@@H](O)[C@H](NC(=O)[C@H]1NC(=O)[C@H](CC(N)=O)NC(=O)[C@H](Cc2ccc(O)cc2)NC(=O)[C@H](CSSC1(C)C)NC(=O)[C@@H](N)Cc1ccccc1)C(N)=O
: