Target
Renin
Ligand
BDBM50022592
Substrate
Meas. Tech.
ChEBML_195784
IC50
10±n/a nM
Citation
 Luly, JRBaMaung, NSoderquist, JFung, AKStein, HKleinert, HDMarcotte, PAEgan, DABopp, BMerits, I Renin inhibitors. Dipeptide analogues of angiotensinogen utilizing a dihydroxyethylene transition-state mimic at the scissile bond to impart greater inhibitory potency. J Med Chem 31:2264-76 (1989)  
Target
Name:
Renin
Synonyms:
Angiotensinogenase RENI_HUMAN
Type:
Enzyme
Mol. Mass.:
45058.99
Organism:
Homo sapiens (Human)
Description:
Residue:
406
  
Inhibitor
Name:
BDBM50022592
Synonyms:
CHEMBL3348547 | {1-[1-(1-Cyclohexylmethyl-2-hydroxy-5-methyl-hexylcarbamoyl)-2-(4H-imidazol-4-yl)-ethylcarbamoyl]-2-phenyl-ethyl}-carbamic acid tert-butyl ester
Type:
Small organic molecule
Emp. Form.:
C34H53N5O5
Mol. Mass.:
611.8151
SMILES:
CC(C)CC[C@H](O)[C@H](CC1CCCCC1)NC(=O)[C@H](Cc1c[nH]cn1)NC(=O)[C@H](Cc1ccccc1)NC(=O)OC(C)(C)C
: