Target
Dopamine beta-hydroxylase
Ligand
BDBM50241361
Substrate
Meas. Tech.
ChEMBL_59268 (CHEMBL668983)
pH
4.5±n/a
Ki
45000±n/a nM
Comments
extracted
Citation
 Kruse, LIKaiser, CDeWolf, WEFrazee, JSGarvey, EHilbert, ELFaulkner, WAFlaim, KESawyer, JLBerkowitz, BA Multisubstrate inhibitors of dopamine beta-hydroxylase. 1. Some 1-phenyl and 1-phenyl-bridged derivatives of imidazole-2-thione. J Med Chem 29:2465-72 (1987)  
Target
Name:
Dopamine beta-hydroxylase
Synonyms:
DBH | DOPO_BOVIN
Type:
PROTEIN
Mol. Mass.:
68136.39
Organism:
Bos taurus
Description:
ChEMBL_50738
Residue:
610
  
Inhibitor
Name:
BDBM50241361
Synonyms:
CHEMBL1515 US9138393, Methimazole | US9144538, Methimazole
Type:
Small organic molecule
Emp. Form.:
C4H6N2S
Mol. Mass.:
114.169
SMILES:
Cn1cc[nH]c1=S
: