Target
Sterol O-acyltransferase 1
Ligand
BDBM50466744
Substrate
Meas. Tech.
ChEMBL_1793846 (CHEMBL4265765)
IC50
170±n/a nM
Citation
 Shibuya, KKawamine, KOzaki, COhgiya, TEdano, TYoshinaka, YTsunenari, Y Discovery of Clinical Candidate 2-(4-(2-((1 H-Benzo[ d]imidazol-2-yl)thio)ethyl)piperazin-1-yl)- N-(6-methyl-2,4-bis(methylthio)pyridin-3-yl)acetamide Hydrochloride [K-604], an Aqueous-Soluble Acyl-CoA:Cholesterol O-Acyltransferase-1 Inhibitor. J Med Chem 61:10635-10650 (2018)  
Target
Name:
Sterol O-acyltransferase 1
Synonyms:
ACACT ACAT Acetyl-CoA acetyltransferase, mitochondrial Acyl-CoA: cholesterol acyltransferase (ACAT) Cholesterol acyltransferase 1 SOAT1 STAT
Type:
Multi-pass membrane protein may form homo- or heterodimers.
Mol. Mass.:
64751.94
Organism:
Homo sapiens (Human)
Description:
P35610
Residue:
550
  
Inhibitor
Name:
BDBM50466744
Synonyms:
CHEMBL4280317
Type:
Small organic molecule
Emp. Form.:
C27H36N4OS2
Mol. Mass.:
496.731
SMILES:
CC(C)c1cccc(C(C)C)c1NC(=O)CN1CCN(CCSc2nc3ccccc3s2)CC1
: