Target
cGMP-inhibited 3',5'-cyclic phosphodiesterase 3B
Ligand
BDBM14777
Substrate
Meas. Tech.
ChEMBL_1796361 (CHEMBL4268478)
IC50
>10000±n/a nM
Citation
 Zheng, HWu, YSun, BCheng, CQiao, YJiang, YZhao, SXie, ZTan, JLou, H Discovery of furyl/thienyl ?-carboline derivatives as potent and selective PDE5 inhibitors with excellent vasorelaxant effect. Eur J Med Chem 158:767-780 (2018)  
Target
Name:
cGMP-inhibited 3',5'-cyclic phosphodiesterase 3B
Synonyms:
CGI-PDE B CGIPDE1 PDE3B Phosphodiesterase 3B Phosphodiesterase Type 3 (PDE3B) cGMP-inhibited 3,5-cyclic phosphodiesterase B
Type:
Enzyme
Mol. Mass.:
124318.95
Organism:
Homo sapiens (Human)
Description:
PDE3B was generated from the full-length recombinant human clone transfected into Sf9 cells.
Residue:
1112
  
Inhibitor
Name:
BDBM14777
Synonyms:
(2R,8R)-2-(2H-1,3-benzodioxol-5-yl)-6-methyl-3,6,17-triazatetracyclo[8.7.0.0^{3,8}.0^{11,16}]heptadeca-1(10),11(16),12,14-tetraene-4,7-dione CHEMBL779 GF 196960 | Tadalafil
Type:
Small organic molecule
Emp. Form.:
C22H19N3O4
Mol. Mass.:
389.404
SMILES:
[H][C@]12Cc3c([nH]c4ccccc34)[C@H](N1C(=O)CN(C)C2=O)c1ccc2OCOc2c1
: