Target
Amyloid-beta precursor protein
Ligand
BDBM50129793
Substrate
Meas. Tech.
ChEMBL_746212 (CHEMBL1775603)
Ki
1.6±n/a nM
Citation
 Lee, BCKim, JSKim, BSSon, JYHong, SKPark, HSMoon, BSJung, JHJeong, JMKim, SE Aromatic radiofluorination and biological evaluation of 2-aryl-6-[18F]fluorobenzothiazoles as a potential positron emission tomography imaging probe for ?-amyloid plaques. Bioorg Med Chem 19:2980-90 (2011)  
Target
Name:
Amyloid-beta precursor protein
Synonyms:
A4 ABPP AICD-50 AICD-59 AID(57) APP Alzheimer disease amyloid protein Amyloid beta Protein Amyloid beta protein Abeta(1-42) Amyloid intracellular domain 57 Amyloid protein (Abeta42b) Beta amyloid A4 protein Beta-APP42 Beta-amyloid protein 42 C83 CVAP Gamma Secretase Gamma-CTF(57) Gamma-secretase Gamma-secretase C-terminal fragment 57 P3(40) PN-II Protease nexin-II S-APP-beta Soluble APP-beta | beta-Amyloid Precursor Protein (APP)
Type:
Single-pass type I membrane protein
Mol. Mass.:
86890.41
Organism:
Homo sapiens (Human)
Description:
P05067
Residue:
770
  
Inhibitor
Name:
BDBM50129793
Synonyms:
2-(4''-methylaminophenyl)-6-hydroxybenzothiazole 2-(4-Methylamino-phenyl)-benzothiazol-6-ol 6-Hydroxy-2-(4''-N-methylaminophenyl)-1,3-benzothiazole CHEMBL93124 N-methyl-[11C]2-(40-methylaminophenyl)-6-hydroxy benzothiazole | [3H]2-(4-(methylamino)phenyl)benzo[d]thiazol-6-ol
Type:
Small organic molecule
Emp. Form.:
C14H12N2OS
Mol. Mass.:
256.323
SMILES:
CNc1ccc(cc1)-c1nc2ccc(O)cc2s1
: