Target
Solute carrier family 22 member 2
Ligand
BDBM81945
Substrate
Meas. Tech.
ChEMBL_838310 (CHEMBL2076808)
Ki
2400±n/a nM
Citation
 Gorboulev, VUlzheimer, JCAkhoundova, AUlzheimer-Teuber, IKarbach, UQuester, SBaumann, CLang, FBusch, AEKoepsell, H Cloning and characterization of two human polyspecific organic cation transporters. DNA Cell Biol 16:871-81 (1997)  
Target
Name:
Solute carrier family 22 member 2
Synonyms:
OCT2 S22A2_HUMAN hOCT2
Type:
PROTEIN
Mol. Mass.:
62591.01
Organism:
Homo sapiens (Human)
Description:
ChEMBL_1484077
Residue:
555
  
Inhibitor
Name:
BDBM81945
Synonyms:
CAS_39484 CHEMBL108926 MPP+ | NSC_39484
Type:
Small organic molecule
Emp. Form.:
C12H12N
Mol. Mass.:
170.2298
SMILES:
C[n+]1ccc(cc1)-c1ccccc1
: