Target
Solute carrier family 22 member 2
Ligand
BDBM50420216
Substrate
Meas. Tech.
ChEMBL_838310 (CHEMBL2076808)
Ki
4800±n/a nM
Citation
 Gorboulev, VUlzheimer, JCAkhoundova, AUlzheimer-Teuber, IKarbach, UQuester, SBaumann, CLang, FBusch, AEKoepsell, H Cloning and characterization of two human polyspecific organic cation transporters. DNA Cell Biol 16:871-81 (1997)  
Target
Name:
Solute carrier family 22 member 2
Synonyms:
OCT2 S22A2_HUMAN hOCT2
Type:
PROTEIN
Mol. Mass.:
62591.01
Organism:
Homo sapiens (Human)
Description:
ChEMBL_1484077
Residue:
555
  
Inhibitor
Name:
BDBM50420216
Synonyms:
MEPIPERPHENIDOL BROMIDE
Type:
Small organic molecule
Emp. Form.:
C19H32NO
Mol. Mass.:
290.4629
SMILES:
CC(C)C(C(O)CC[N+]1(C)CCCCC1)c1ccccc1
: