Target
Reverse transcriptase/RNaseH
Ligand
BDBM50029663
Substrate
Meas. Tech.
ChEMBL_195839 (CHEMBL799138)
IC50
600±n/a nM
Citation
 Dollé, VFan, ENguyen, CHAubertin, AMKirn, AAndreola, MLJamieson, GTarrago-Litvak, LBisagni, E A new series of pyridinone derivatives as potent non-nucleoside human immunodeficiency virus type 1 specific reverse transcriptase inhibitors. J Med Chem 38:4679-86 (1995)  
Target
Name:
Reverse transcriptase/RNaseH
Synonyms:
HIV-1 Reverse Transcriptase RNase H Reverse transcriptase/RNaseH
Type:
PROTEIN
Mol. Mass.:
65229.15
Organism:
Human immunodeficiency virus 1
Description:
ChEMBL_1473730
Residue:
566
  
Inhibitor
Name:
BDBM50029663
Synonyms:
4-(3,5-Dimethyl-phenylsulfanyl)-5-ethyl-6-methyl-2-oxo-1,2-dihydro-pyridine-3-carboxylic acid ethyl ester | CHEMBL357409
Type:
Small organic molecule
Emp. Form.:
C19H23NO3S
Mol. Mass.:
345.456
SMILES:
CCOC(=O)c1c(Sc2cc(C)cc(C)c2)c(CC)c(C)[nH]c1=O
: