Target
Reverse transcriptase/RNaseH
Ligand
BDBM50029679
Substrate
Meas. Tech.
ChEMBL_195839 (CHEMBL799138)
IC50
>4000±n/a nM
Citation
 Dollé, VFan, ENguyen, CHAubertin, AMKirn, AAndreola, MLJamieson, GTarrago-Litvak, LBisagni, E A new series of pyridinone derivatives as potent non-nucleoside human immunodeficiency virus type 1 specific reverse transcriptase inhibitors. J Med Chem 38:4679-86 (1995)  
Target
Name:
Reverse transcriptase/RNaseH
Synonyms:
HIV-1 Reverse Transcriptase RNase H Reverse transcriptase/RNaseH
Type:
PROTEIN
Mol. Mass.:
65229.15
Organism:
Human immunodeficiency virus 1
Description:
ChEMBL_1473730
Residue:
566
  
Inhibitor
Name:
BDBM50029679
Synonyms:
3-Amino-5-methyl-4-m-tolylsulfanyl-1H-pyridin-2-one | CHEMBL140048
Type:
Small organic molecule
Emp. Form.:
C13H14N2OS
Mol. Mass.:
246.328
SMILES:
Cc1cccc(Sc2c(C)c[nH]c(=O)c2N)c1
: