Target
5-hydroxytryptamine receptor 1A
Ligand
BDBM50036919
Substrate
Meas. Tech.
ChEMBL_861 (CHEMBL615917)
IC50
0.64±n/a nM
Citation
 Norman, MHRigdon, GCNavas, FCooper, BR Cyclic benzamides as mixed dopamine D2/serotonin 5-HT2 receptor antagonists: potential atypical antipsychotic agents. J Med Chem 37:2552-63 (1994)  
Target
Name:
5-hydroxytryptamine receptor 1A
Synonyms:
5-HT-1A 5-HT1A 5-hydroxytryptamine receptor 1A (5HT1A) 5ht1a Htr1a Serotonin 1a (5-HT1a) receptor/Adrenergic receptor alpha-1 | Serotonin receptor 1A
Type:
G Protein-Coupled Receptor (GPCR)
Mol. Mass.:
46445.29
Organism:
Rattus norvegicus (rat)
Description:
Binding assays were performed using rat hippocampal membranes.
Residue:
422
  
Inhibitor
Name:
BDBM50036919
Synonyms:
2-[4-(4-Benzo[d]isothiazol-3-yl-piperazin-1-yl)-butyl]-3,4-dihydro-2H-isoquinolin-1-one | CHEMBL86013
Type:
Small organic molecule
Emp. Form.:
C24H28N4OS
Mol. Mass.:
420.57
SMILES:
O=C1N(CCCCN2CCN(CC2)c2nsc3ccccc23)CCc2ccccc12
: