Target
Carbonic anhydrase 2
Ligand
BDBM50038964
Substrate
Meas. Tech.
ChEMBL_45051 (CHEMBL658049)
Kd
2.5±n/a nM
Citation
 Jain, AWhitesides, GMAlexander, RSChristianson, DW Identification of two hydrophobic patches in the active-site cavity of human carbonic anhydrase II by solution-phase and solid-state studies and their use in the development of tight-binding inhibitors. J Med Chem 37:2100-5 (1994)  
Target
Name:
Carbonic anhydrase 2
Synonyms:
CA-II CAC Carbonate dehydratase II Carbonic anhydrase 2 (CA-II) Carbonic anhydrase C Carbonic anhydrase II (CA-II) Carbonic anhydrase II (hCA II) | Carbonic anhydrase isoenzyme II (hCA II)
Type:
Enzyme
Mol. Mass.:
29250.71
Organism:
Homo sapiens (Human)
Description:
P00918
Residue:
260
  
Inhibitor
Name:
BDBM50038964
Synonyms:
CHEMBL294548 | N-Octyl-4-sulfamoyl-benzamide
Type:
Small organic molecule
Emp. Form.:
C15H24N2O3S
Mol. Mass.:
312.428
SMILES:
CCCCCCCCNC(=O)c1ccc(cc1)S(N)(=O)=O
: