Target
Cannabinoid receptor 1
Ligand
BDBM50234418
Substrate
Meas. Tech.
ChEMBL_1278954 (CHEMBL3097437)
Ki
6000±n/a nM
Citation
 Lueg, CSchepmann, DGünther, RBrust, PWünsch, B Development of fluorinated CB(2) receptor agonists for PET studies. Bioorg Med Chem 21:7481-98 (2013)  
Target
Name:
Cannabinoid receptor 1
Synonyms:
CANN6 CB-R CNR CNR1_HUMAN Cannabinoid receptor Cannabinoid receptor 1 (brain)
Type:
G Protein-Coupled Receptor (GPCR)
Mol. Mass.:
52868.96
Organism:
Homo sapiens (Human)
Description:
P21554
Residue:
472
  
Inhibitor
Name:
BDBM50234418
Synonyms:
(2,3-Dichloro-phenyl)-[5-methoxy-2-methyl-3-(2-morpholin-4-yl-ethyl)-indol-1-yl]-methanone CHEMBL73711 L-768242
Type:
Small organic molecule
Emp. Form.:
C23H24Cl2N2O3
Mol. Mass.:
447.354
SMILES:
COc1ccc2n(C(=O)c3cccc(Cl)c3Cl)c(C)c(CCN3CCOCC3)c2c1
: