Target
Leukotriene B4 receptor 1
Ligand
BDBM50042184
Substrate
Meas. Tech.
ChEBML_153299
Ki
150±n/a nM
Citation
 Daines, RAChambers, PAPendrak, IJakas, DRSarau, HMFoley, JJSchmidt, DBKingsbury, WD Trisubstituted pyridine leukotriene B4 receptor antagonists: synthesis and structure-activity relationships. J Med Chem 36:3321-32 (1993)  
Target
Name:
Leukotriene B4 receptor 1
Synonyms:
BLT BLTR Chemoattractant receptor-like 1 GPR16 LTB4-R 1 Leukotriene B4 R1 Leukotriene B4 receptor 1 P2Y purinoceptor 7 | P2Y7
Type:
Enzyme Catalytic Domain
Mol. Mass.:
37582.68
Organism:
Homo sapiens (Human)
Description:
Q15722
Residue:
352
  
Inhibitor
Name:
BDBM50042184
Synonyms:
3-{6-(2-Carboxy-vinyl)-5-[8-(4-methoxy-phenyl)-octyloxy]-1-oxy-pyridin-2-ylmethoxy}-benzoic acid | CHEMBL110797
Type:
Small organic molecule
Emp. Form.:
C31H35NO8
Mol. Mass.:
549.6115
SMILES:
COc1ccc(CCCCCCCCOc2ccc(COc3cccc(c3)C(O)=O)[n+]([O-])c2\C=C\C(O)=O)cc1
: