Target
Purine nucleoside phosphorylase
Ligand
BDBM50042360
Substrate
Meas. Tech.
ChEBML_153331
Ki
3500±n/a nM
Citation
 Kelley, JLLinn, JAMcLean, EWTuttle, JV 9-[(Phosphonoalkyl)benzyl]guanines. Multisubstrate analogue inhibitors of human erythrocyte purine nucleoside phosphorylase. J Med Chem 36:3455-63 (1993)  
Target
Name:
Purine nucleoside phosphorylase
Synonyms:
Inosine phosphorylase NP PNPH_HUMAN | Purine nucleoside phosphorylase (PNPase)
Type:
Enzyme
Mol. Mass.:
32119.53
Organism:
Homo sapiens (Human)
Description:
Residue:
289
  
Inhibitor
Name:
BDBM50042360
Synonyms:
CHEMBL117588 | [4-(2-Amino-6-oxo-1,6-dihydro-purin-9-ylmethyl)-benzyloxymethyl]-phosphonic acid
Type:
Small organic molecule
Emp. Form.:
C14H16N5O5P
Mol. Mass.:
365.2811
SMILES:
Nc1nc2n(Cc3ccc(COCP(O)(O)=O)cc3)cnc2c(=O)[nH]1
: