Target
5-hydroxytryptamine receptor 1A
Ligand
BDBM50044237
Substrate
Meas. Tech.
ChEBML_605
Ki
0.200000±n/a nM
Citation
 Stjernlöf, PGullme, MElebring, TAndersson, BWikström, HLagerquist, SSvensson, KEkman, ACarlsson, ASundell, S (S)- and (R)-8-(di-n-propylamino)-6,7,8,9-tetrahydro-3H-benz[e]indole-1- carbaldehyde: a new class of orally active 5-HT1A-receptor agonists. J Med Chem 36:2059-65 (1993)  
Target
Name:
5-hydroxytryptamine receptor 1A
Synonyms:
5-HT1A 5-hydroxytryptamine receptor 1A (5HT1A) Gpcr18 Serotonin 1a (5-HT1a) receptor
Type:
Enzyme
Mol. Mass.:
46192.09
Organism:
Mus musculus (Mouse)
Description:
Q64264
Residue:
421
  
Inhibitor
Name:
BDBM50044237
Synonyms:
CHEMBL65274 | R-(+)-1-(8-Dipropylamino-6,7,8,9-tetrahydro-3H-benzo[e]indol-1-yl)-ethanone
Type:
Small organic molecule
Emp. Form.:
C20H28N2O
Mol. Mass.:
312.4491
SMILES:
CCCN(CCC)[C@@H]1CCc2ccc3[nH]cc(C(C)=O)c3c2C1
: