Target
Renin
Ligand
BDBM50046782
Substrate
Meas. Tech.
ChEMBL_195746 (CHEMBL801598)
pH
7.4±n/a
IC50
11±n/a nM
Comments
extracted
Citation
 Rosenberg, SHSpina, KPWoods, KWPolakowski, JMartin, DLYao, ZStein, HHCohen, JBarlow, JLEgan, DA Studies directed toward the design of orally active renin inhibitors. 1. Some factors influencing the absorption of small peptides. J Med Chem 36:449-59 (1993)  
Target
Name:
Renin
Synonyms:
Angiotensinogenase RENI_HUMAN
Type:
Enzyme
Mol. Mass.:
45058.99
Organism:
Homo sapiens (Human)
Description:
Residue:
406
  
Inhibitor
Name:
BDBM50046782
Synonyms:
CHEMBL341744 | N-[2-Azido-1-(1-cyclohexylmethyl-2,3-dihydroxy-5-methyl-hexylcarbamoyl)-ethyl]-2-benzyl-4-morpholin-4-yl-4-oxo-butyramide
Type:
Small organic molecule
Emp. Form.:
C32H50N6O6
Mol. Mass.:
614.776
SMILES:
CC(C)C[C@H](O)[C@H](O)[C@H](CC1CCCCC1)NC(=O)[C@H](CN=[N+]=[N-])NC(=O)[C@@H](CC(=O)N1CCOCC1)Cc1ccccc1
: