Target
Type-1 angiotensin II receptor
Ligand
BDBM50047810
Substrate
Meas. Tech.
ChEMBL_36941 (CHEMBL648844)
IC50
2100±n/a nM
Citation
 Ashton, WTCantone, CLChang, LLHutchins, SMStrelitz, RAMacCoss, MChang, RSLotti, VJFaust, KAChen, TB Nonpeptide angiotensin II antagonists derived from 4H-1,2,4-triazoles and 3H-imidazo[1,2-b][1,2,4]triazoles. J Med Chem 36:591-609 (1993)  
Target
Name:
Type-1 angiotensin II receptor
Synonyms:
AGTR1 ANGIOTENSIN AT1 Angiotensin II type 1a (AT-1a) receptor
Type:
Enzyme Catalytic Domain
Mol. Mass.:
41009.15
Organism:
RABBIT
Description:
ANGIOTENSIN AT1 AGTR1 RABBIT::P34976
Residue:
359
  
Inhibitor
Name:
BDBM50047810
Synonyms:
CHEMBL348149 | N-[4-(3-Propylsulfanyl-5-trifluoromethyl-[1,2,4]triazol-4-ylmethyl)-phenyl]-phthalamic acid
Type:
Small organic molecule
Emp. Form.:
C21H19F3N4O3S
Mol. Mass.:
464.461
SMILES:
CCCSc1nnc(n1Cc1ccc(NC(=O)c2ccccc2C(O)=O)cc1)C(F)(F)F
: