Target
Angiotensin-converting enzyme
Ligand
BDBM50048514
Substrate
Meas. Tech.
ChEMBL_34783 (CHEMBL646224)
IC50
30±n/a nM
Citation
 Robl, JACimarusti, MPSimpkins, LMBrown, BRyono, DEBird, JEAsaad, MMSchaeffer, TRTrippodo, NC Dual metalloprotease inhibitors. 6. Incorporation of bicyclic and substituted monocyclic azepinones as dipeptide surrogates in angiotensin-converting enzyme/neutral endopeptidase inhibitors. J Med Chem 39:494-502 (1996)  
Target
Name:
Angiotensin-converting enzyme
Synonyms:
3.2.1.- ACE Angiotensin-converting enzyme, soluble form DCP1 Kininase II
Type:
Mol. Mass.:
150405.15
Organism:
Oryctolagus cuniculus
Description:
Residue:
1310
  
Inhibitor
Name:
BDBM50048514
Synonyms:
(S)-1-[(S)-2-((S)-2-Mercapto-3-phenyl-propionylamino)-propionyl]-pyrrolidine-2-carboxylic acid | CHEMBL287896
Type:
Small organic molecule
Emp. Form.:
C17H22N2O4S
Mol. Mass.:
350.433
SMILES:
C[C@H](NC(=O)[C@@H](S)Cc1ccccc1)C(=O)N1CCC[C@H]1C(O)=O
: