Target
Neprilysin
Ligand
BDBM50048508
Substrate
Meas. Tech.
ChEMBL_144479 (CHEMBL754638)
IC50
1653±n/a nM
Citation
 Robl, JACimarusti, MPSimpkins, LMBrown, BRyono, DEBird, JEAsaad, MMSchaeffer, TRTrippodo, NC Dual metalloprotease inhibitors. 6. Incorporation of bicyclic and substituted monocyclic azepinones as dipeptide surrogates in angiotensin-converting enzyme/neutral endopeptidase inhibitors. J Med Chem 39:494-502 (1996)  
Target
Name:
Neprilysin
Synonyms:
Mme Neprilysin Neutral endopeptidase 24.11
Type:
Protein
Mol. Mass.:
85789.59
Organism:
Rattus norvegicus (Rat)
Description:
P07861
Residue:
750
  
Inhibitor
Name:
BDBM50048508
Synonyms:
CHEMBL147153 | [(3S,7R)-7-Cyclopentyl-3-((S)-2-mercapto-3-phenyl-propionylamino)-2-oxo-azepan-1-yl]-acetic acid
Type:
Small organic molecule
Emp. Form.:
C22H30N2O4S
Mol. Mass.:
418.55
SMILES:
OC(=O)CN1[C@H](CCC[C@H](NC(=O)[C@@H](S)Cc2ccccc2)C1=O)C1CCCC1
: