Target
Neprilysin
Ligand
BDBM50048511
Substrate
Meas. Tech.
ChEMBL_144479 (CHEMBL754638)
IC50
31±n/a nM
Citation
 Robl, JACimarusti, MPSimpkins, LMBrown, BRyono, DEBird, JEAsaad, MMSchaeffer, TRTrippodo, NC Dual metalloprotease inhibitors. 6. Incorporation of bicyclic and substituted monocyclic azepinones as dipeptide surrogates in angiotensin-converting enzyme/neutral endopeptidase inhibitors. J Med Chem 39:494-502 (1996)  
Target
Name:
Neprilysin
Synonyms:
Mme Neprilysin Neutral endopeptidase 24.11
Type:
Protein
Mol. Mass.:
85789.59
Organism:
Rattus norvegicus (Rat)
Description:
P07861
Residue:
750
  
Inhibitor
Name:
BDBM50048511
Synonyms:
CHEMBL146371 | [(3S,7R)-7-(2-Hydroxy-ethyl)-3-((S)-2-mercapto-3-phenyl-propionylamino)-2-oxo-azepan-1-yl]-acetic acid
Type:
Small organic molecule
Emp. Form.:
C19H26N2O5S
Mol. Mass.:
394.485
SMILES:
OCC[C@H]1CCC[C@H](NC(=O)[C@@H](S)Cc2ccccc2)C(=O)N1CC(O)=O
: