Target
Thymidylate synthase
Ligand
BDBM50049167
Substrate
Meas. Tech.
ChEMBL_209957 (CHEMBL820613)
IC50
4.6±n/a nM
Citation
 Bavetsias, VJackman, ALKimbell, RGibson, WBoyle, FTBisset, GM Quinazoline antifolate thymidylate synthase inhibitors: gamma-linked L-D, D-D, and D-L dipeptide analogues of 2-desamino-2-methyl-N10-propargyl-5,8-dideazafolic acid (ICI 198583). J Med Chem 39:73-85 (1996)  
Target
Name:
Thymidylate synthase
Synonyms:
TS TYSY_MOUSE | Tyms
Type:
PROTEIN
Mol. Mass.:
34957.15
Organism:
Mus musculus
Description:
ChEMBL_1340097
Residue:
307
  
Inhibitor
Name:
BDBM50049167
Synonyms:
(R)-2-((S)-4-Carboxy-4-{4-[(2,7-dimethyl-4-oxo-3,4-dihydro-quinazolin-6-ylmethyl)-methyl-amino]-benzoylamino}-butyrylamino)-pentanedioic acid; TFA | CHEMBL367732
Type:
Small organic molecule
Emp. Form.:
C29H33N5O9
Mol. Mass.:
595.6004
SMILES:
CN(Cc1cc2c(cc1C)nc(C)[nH]c2=O)c1ccc(cc1)C(=O)N[C@@H](CCC(=O)N[C@H](CCC(O)=O)C(O)=O)C(O)=O
: