Target
Cholecystokinin receptor type A
Ligand
BDBM50454480
Substrate
Meas. Tech.
ChEMBL_50056 (CHEMBL662425)
IC50
400±n/a nM
Citation
 Castro, JLBall, RGBroughton, HBRussell, MGRathbone, DWatt, APBaker, RChapman, KLFletcher, AEPatel, SSmith, AJMarshall, GRRyecroft, WMatassa, VG Controlled modification of acidity in cholecystokinin B receptor antagonists: N-(1,4-benzodiazepin-3-yl)-N'-[3-(tetrazol-5-ylamino) phenyl]ureas. J Med Chem 39:842-9 (1996)  
Target
Name:
Cholecystokinin receptor type A
Synonyms:
CCKAR_RAT Cholecystokinin peripheral Cholecystokinin receptor type A
Type:
Enzyme Catalytic Domain
Mol. Mass.:
49676.37
Organism:
RAT
Description:
Cholecystokinin central 0 RAT::P30551
Residue:
444
  
Inhibitor
Name:
BDBM50454480
Synonyms:
CHEMBL2093059
Type:
Small organic molecule
Emp. Form.:
C25H29N9O2
Mol. Mass.:
487.5569
SMILES:
CN(c1nn[nH]n1)c1cccc(NC(=O)N[C@@H]2N=C(C3CCCCC3)c3ccccc3N(C)C2=O)c1
: