Target
Gastrin/cholecystokinin type B receptor
Ligand
BDBM50049785
Substrate
Meas. Tech.
ChEMBL_47830 (CHEMBL662572)
IC50
0.3±n/a nM
Citation
 Castro, JLBall, RGBroughton, HBRussell, MGRathbone, DWatt, APBaker, RChapman, KLFletcher, AEPatel, SSmith, AJMarshall, GRRyecroft, WMatassa, VG Controlled modification of acidity in cholecystokinin B receptor antagonists: N-(1,4-benzodiazepin-3-yl)-N'-[3-(tetrazol-5-ylamino) phenyl]ureas. J Med Chem 39:842-9 (1996)  
Target
Name:
Gastrin/cholecystokinin type B receptor
Synonyms:
CCK-2 receptor CCK-BR CCKRB Cholecystokinin receptor GASR_HUMAN | Gastrin/cholecystokinin type B receptor
Type:
G Protein-Coupled Receptor (GPCR)
Mol. Mass.:
48445.79
Organism:
Homo sapiens (Human)
Description:
Stable expression of human CCK-2 receptors in HEK 293 cells.
Residue:
447
  
Inhibitor
Name:
BDBM50049785
Synonyms:
1-((R)-5-Cyclohexyl-1-methyl-2-oxo-2,3-dihydro-1H-benzo[e][1,4]diazepin-3-yl)-3-{4-methyl-3-[methyl-(1H-tetrazol-5-yl)-amino]-phenyl}-urea | CHEMBL168253
Type:
Small organic molecule
Emp. Form.:
C26H31N9O2
Mol. Mass.:
501.5834
SMILES:
CN(c1nnn[nH]1)c1cc(NC(=O)N[C@@H]2N=C(C3CCCCC3)c3ccccc3N(C)C2=O)ccc1C
: