Target
Cholecystokinin receptor type A
Ligand
BDBM50006878
Substrate
Meas. Tech.
ChEMBL_50056 (CHEMBL662425)
IC50
736±n/a nM
Citation
 Castro, JLBall, RGBroughton, HBRussell, MGRathbone, DWatt, APBaker, RChapman, KLFletcher, AEPatel, SSmith, AJMarshall, GRRyecroft, WMatassa, VG Controlled modification of acidity in cholecystokinin B receptor antagonists: N-(1,4-benzodiazepin-3-yl)-N'-[3-(tetrazol-5-ylamino) phenyl]ureas. J Med Chem 39:842-9 (1996)  
Target
Name:
Cholecystokinin receptor type A
Synonyms:
CCKAR_RAT Cholecystokinin peripheral Cholecystokinin receptor type A
Type:
Enzyme Catalytic Domain
Mol. Mass.:
49676.37
Organism:
RAT
Description:
Cholecystokinin central 0 RAT::P30551
Residue:
444
  
Inhibitor
Name:
BDBM50006878
Synonyms:
(R)-1-(1-Methyl-2-oxo-5-phenyl-2,3-dihydro-1H-benzo[e][1,4]diazepin-3-yl)-3-m-tolyl-urea (RS)-1-(1-Methyl-2-oxo-5-phenyl-2,3-dihydro-1H-benzo[e][1,4]diazepin-3-yl)-3-m-tolyl-urea 1-((R)-1-Methyl-2-oxo-5-phenyl-2,3-dihydro-1H-benzo[e][1,4]diazepin-3-yl)-3-m-tolyl-urea 1-(1-Methyl-2-oxo-5-phenyl-2,3-dihydro-1H-benzo[e][1,4]diazepin-3-yl)-3-m-tolyl-urea 1-(1-Methyl-2-oxo-5-phenyl-2,3-dihydro-1H-benzo[e][1,4]diazepin-3-yl)-3-m-tolyl-urea (L-365,260) 1-(1-Methyl-2-oxo-5-phenyl-2,3-dihydro-1H-benzo[e][1,4]diazepin-3-yl)-3-m-tolyl-urea(L-365260) 1-(1-Methyl-2-oxo-5-phenyl-2,3-dihydro-1H-benzo[e][1,4]diazepin-3-yl)-3-p-tolyl-urea L-365260 | LY-365260
Type:
Small organic molecule
Emp. Form.:
C24H22N4O2
Mol. Mass.:
398.4571
SMILES:
CN1c2ccccc2C(=N[C@@H](NC(=O)Nc2ccc(C)cc2)C1=O)c1ccccc1
: